Meteorological Operational Satellite (METOP)
type: Concept

METOP-C
type: Concept
change note: 2020-05-22 12:16:00.0 [sritz] insert AltLabel (id: null category: primary text: Meteorological Operational Satellite - C language code: en);
change note: 2018-06-12 13:26:49.0 [mmorahan] Insert Concept add broader relation (METOP-C [6120cea0-c943-4c7c-bddd-8d8648d58022,367687] - METOP [8c192c86-d07c-4e7b-af8f-92aa4b40fca7,345373]);
change note: 2018-06-12 13:28:30.0 [mmorahan] insert Definition (id: null text: Global Data Service. Regional Data Service. Direct Readout Service. Real-time Imagery. Launch planned in September 2018 language code: en);
change note: 2019-02-21 16:43:55.0 [mmorahan] insert WeightedRelation (id: null related concept uuid: e64e83bd-02b3-4a47-830d-00e1aa4b04d3 relationship type: null relationship value: null generated by: null);
definition: Global Data Service. Regional Data Service. Direct Readout Service. Real-time Imagery. Launch planned in September 2018
in scheme: platforms