GLACIER FACIES
type: Concept
change note: 2012-07-10 10:43:00.0 [mpmorahan] insert Definition (id: null text: In general, facies are the set of all characteristics of a sedimetary rock that indicates its particular environment of deposition and which distinguish it from other facies in the same rock. Glacial facies refer to the characteristic nature of glacial ice and/or the processes by which the ice formed and processes by which rock debris from the bed is entrained into the ice. language code: en);
change note: 2012-06-26 13:24:36.0 [gee-cee] Insert Concept add broader relation (GLACIER FACIES [613c1fba-8710-47fb-a8e1-e4cd50bb97e1,39911] - GLACIAL MEASUREMENTS [2d79af4f-d15f-40cc-b0bf-8f5c8eb1fce5,39907]);
in scheme: sciencekeywords
definition: In general, facies are the set of all characteristics of a sedimetary rock that indicates its particular environment of deposition and which distinguish it from other facies in the same rock. Glacial facies refer to the characteristic nature of glacial ice and/or the processes by which the ice formed and processes by which rock debris from the bed is entrained into the ice.

GLACIAL MEASUREMENTS
type: Concept