RANGE CHANGES
type: Concept
change note: 2017-03-15 11:50:36.0 [mgenazzi] Definition updated update Definition (Range Changes with respect to Migration include forays outside the home range, usually in search of suitable habitat or mating opportunities.); update Definition (Feldhamer, G., L.Drickamer, S.Vessey, J.Merritt. 1999. Mammalogy: Adaptation, Diversity, Ecology. McGraw Hill-Hill Companies, Inc. );
in scheme: sciencekeywords
definition: Range Changes with respect to Migration include forays outside the home range, usually in search of suitable habitat or mating opportunities.

SPECIES/POPULATION INTERACTIONS
type: Concept