GAS FLARING
type: Concept
change note: 2012-07-11 10:01:56.0 [tbs1979] update Definition (Merriam-Webster online 1999 ); update Definition (Refers to the burning of a jet of waste gas in the open air.);
in scheme: sciencekeywords
definition: Refers to the burning of a jet of waste gas in the open air.

ENVIRONMENTAL IMPACTS
type: Concept