CAR
type: Concept
change note: 2018-02-14 07:37:10.0 [tstevens] insert AltLabel (id: null category: primary text: Cloud Absorption Radiometer language code: en); insert Definition (id: null text: The CAR project consists of many missions spanning the globe. The versatility of the CAR measurements has allowed for multiple missions investigating snow melt and albedo, air quality, ocean reflectance anisotropy and implications in ocean color remote sensing problems, radiative characteristics of clouds embedded in smoke, and changes in vegetation. Although the applications of the instrument and data have expanded over time, primary applications were for cloud diffusion domain studies and measurements of bidirectional reflectance. language code: en);
change note: 2018-02-14 07:34:42.0 [tstevens] Insert Concept add broader relation (CAR [62469de4-6734-48a6-8c07-bc571d0e5d21,310563] - A - C [0c89f3f4-7ab1-43ce-89ee-795d35f0e30a,292045]);
in scheme: projects
definition: The CAR project consists of many missions spanning the globe. The versatility of the CAR measurements has allowed for multiple missions investigating snow melt and albedo, air quality, ocean reflectance anisotropy and implications in ocean color remote sensing problems, radiative characteristics of clouds embedded in smoke, and changes in vegetation. Although the applications of the instrument and data have expanded over time, primary applications were for cloud diffusion domain studies and measurements of bidirectional reflectance.

A - C
type: Concept