BIOLOGICAL RECORDS
type: Concept

BIOMARKER
type: Concept
change note: 2012-07-19 10:15:53.0 [mpmorahan] insert Definition (id: null text: A biomarker, or biological marker, is an indicator of a biological state. It is a characteristic that is objectively measured and evaluated as an indicator of normal biological processes, pathogenic processes, or pharmacologic responses to a therapeutic intervention. It is used in many scientific fields. language code: en);
change note: 2012-06-26 13:52:05.0 [gee-cee] Insert Concept add broader relation (BIOMARKER [625ac4b3-a126-4c98-a061-3a780b942280,39953] - BIOLOGICAL RECORDS [5553fe9d-ab0a-4305-86a6-1f7f697e15e4,39951]);
in scheme: sciencekeywords
definition: A biomarker, or biological marker, is an indicator of a biological state. It is a characteristic that is objectively measured and evaluated as an indicator of normal biological processes, pathogenic processes, or pharmacologic responses to a therapeutic intervention. It is used in many scientific fields.