COMMERCIAL
type: Concept

SPS
type: Concept
in scheme: providers
definition: Space Research Software, Inc is a Illinois based software company specialized in scientific data visualization. Summary Provided by: http://www.space-research.org/