NHML
type: Concept
in scheme: providers
definition: At the Natural History Museum, we want to make sure the visitor experience is always improving and that we reach a wide variety of people. Through our long tradition of visitor studies, we carry out audience research, evaluation and consultation on many of our exhibitions, activities and programmes. Summary Provided by: http://www.nhm.ac.uk/about-us/visitor-research/index.html

ACADEMIC
type: Concept