USDA/NRCS/NCGC
type: Concept
in scheme: providers
definition: The National Cartography and Geospatial Center (NCGC) produces maps to support various Natural Resource Conservation Service (NRCS) projects and programs. In addition to producing maps, NCGC researches new digital technologies for creating maps. New techniques and procedures are posted to the NCGC Web site and shared with customers to use in developing their own maps. NCGC is a major distributor of geospatial data to support NRCS, National, State and local field needs. Website: "http://www.ncgc.nrcs.usda.gov/" [Summary provided by the USDA.]

USDA
type: Concept