ENERGY PRODUCTION/USE
type: Concept

WAVE ENERGY PRODUCTION/USE
type: Concept
change note: 2012-06-29 13:57:11.0 [tbs1979] insert Definition (id: null text: Refers to the production and use of wave energy for human consumption. Wave energy is the transport of energy by ocean surface waves, and the capture of that energy to do useful work. language code: en);
change note: 2012-06-26 15:47:48.0 [tbs1979] Insert Concept add broader relation (WAVE ENERGY PRODUCTION/USE [62c1fec5-3512-4136-a060-ec2338a48296,40123] - ENERGY PRODUCTION/USE [b73cee46-8e2c-4df9-b1ed-7f0aa98a04ac,40101]);
in scheme: sciencekeywords
definition: Refers to the production and use of wave energy for human consumption. Wave energy is the transport of energy by ocean surface waves, and the capture of that energy to do useful work.