IS-40e
type: Concept
change note: 2022-03-23 08:44:06.0 [tstevens] insert AltLabel (id: null category: primary text: Intelsat 40e language code: en); insert Definition (id: null text: Maxar Technologies and Intelsat recently agreed to partner to host NASA’s Tropospheric Emissions: Monitoring of Pollution (TEMPO) instrument onboard the Intelsat 40e mission. In 2019, NASA selected Maxar to host the TEMPO instrument utilizing the U.S. Air Force Hosted Payload Solutions (HoPS) contract vehicle. Intelsat 40e is based on Maxar's 1300-class satellite platform and will provide commercial satellite communications for Intelsat customers in North and Central America. The satellite is scheduled to launch into geostationary orbit 22,236 miles above Earth's equator in 2022. language code: en);
change note: 2022-03-23 08:41:52.0 [tstevens] Insert Concept add broader relation (IS-40e [62de6540-a614-4770-9e68-fde03001fdb4,865211] - Earth Observation Satellites [3466eed1-2fbb-49bf-ab0b-dc08731d502b,855320]);
in scheme: platforms
definition: Maxar Technologies and Intelsat recently agreed to partner to host NASA’s Tropospheric Emissions: Monitoring of Pollution (TEMPO) instrument onboard the Intelsat 40e mission. In 2019, NASA selected Maxar to host the TEMPO instrument utilizing the U.S. Air Force Hosted Payload Solutions (HoPS) contract vehicle. Intelsat 40e is based on Maxar's 1300-class satellite platform and will provide commercial satellite communications for Intelsat customers in North and Central America. The satellite is scheduled to launch into geostationary orbit 22,236 miles above Earth's equator in 2022.

Earth Observation Satellites
type: Concept