SEA ICE
type: Concept

ICE EXTENT
type: Concept
in scheme: sciencekeywords
definition: The minimum or maximum length of the ice or ice edge into the open water. Also refers to the extent of the ice pack into the open ocean (which varies seasonally).