AGI/CRB
type: Concept
in scheme: providers
definition: The Antarctic Bibliography covers all disciplines related to the region including biological and geological sciences, medical sciences, meteorology, oceanography, atmospheric and terrestrial physics, expeditions, logistics equipment and supplies, and tourism. Summary Provided By: http://www.coldregions.org/antinfo.htm

CONSORTIA/INSTITUTIONS
type: Concept