Surface
type: Concept

R/V PROFESSOR KHROMOV
type: Concept
change note: 2022-02-23 13:56:09.0 [tstevens] insert Definition (id: null text: The purpose for the cruise was to quantitatively clarify the physical, chemical and biological processes which occur in the Sea of Okhotsk. This expedition is collaboration between Far Eastern Regional Hydrometeorological Research Institute (FERHRI), Russia, and the Institute of Low Temperature Sciences, Hokkaido University, Japan. Especially this expedition focused on to sedimentary iron transport processes from northwestern continental shelf of the Sea of Okhotsk to western subarctic Pacific. language code: en);
change note: 2021-11-18 09:24:21.0 [tstevens] Move Concepts delete broader relation (null); add broader relation (R/V PROFESSOR KHROMOV [6405bead-664f-4452-b1d8-39b1f889ebaf,826314] - Surface [59b97a6c-385e-40a2-8422-ecbdb6023c4c,835900]);
change note: 2012-06-29 15:59:25.0 [aaleman] Insert Concept add broader relation (R/V PROFESSOR KHROMOV [5650f8fe-8db8-4bb1-927a-54a214d30ca1,40281] - SHIPS [82a67b12-e99d-4c90-8a6a-a6f79d4c3c7b,31201]);
in scheme: platforms
definition: The purpose for the cruise was to quantitatively clarify the physical, chemical and biological processes which occur in the Sea of Okhotsk. This expedition is collaboration between Far Eastern Regional Hydrometeorological Research Institute (FERHRI), Russia, and the Institute of Low Temperature Sciences, Hokkaido University, Japan. Especially this expedition focused on to sedimentary iron transport processes from northwestern continental shelf of the Sea of Okhotsk to western subarctic Pacific.