ENERGY OUTPUT
type: Concept
change note: 2013-03-11 15:34:03.0 [tbs1979] insert Definition (id: null text: The amount of heat output from a geothermal energy source. language code: en);
change note: 2013-03-05 09:46:52.0 [tbs1979] Insert Concept add broader relation (ENERGY OUTPUT [64461e23-b3c1-4b99-b879-84e54bacdb24,82893] - GEOTHERMAL ENERGY [33d1810f-40c6-4b37-ac90-7435ef5fa507,61791]);
in scheme: sciencekeywords
definition: The amount of heat output from a geothermal energy source.

GEOTHERMAL ENERGY
type: Concept