Propeller
type: Concept

UWKA
type: Concept
definition: The University of Wyoming Beechcraft King Air 200T (N2UW) is the third atmospheric research aircraft we have operated since the mid 1960's. Click here for photos. Click here for driving instructions to the facility.
change note: 2022-02-17 14:54:54.0 [tstevens] update Definition (The University of Wyoming Beechcraft King Air 200T (N2UW) is the third atmospheric research aircraft we have operated since the mid 1960's. Click here for photos. Click here for driving instructions to the facility.);
change note: 2021-11-17 13:24:04.0 [tstevens] Move Concepts delete broader relation (null); add broader relation (UWKA [64b518f5-2026-4c5b-9bae-9fa55b5b5778,826317] - Propeller [6175c78e-432c-4254-b442-40d3cf0f6b34,835882]);
change note: 2013-07-02 17:00:43.0 [saritz] Added primary preferred label. insert AltLabel (id: null text: University of Wyoming King Air language code: en);
change note: 2013-07-02 17:02:52.0 [saritz] Added definition. insert Definition (id: null text: The University of Wyoming Beechcraft King Air 200T (N2UW) is the third atmospheric research aircraft we have operated since the mid 1960's. Click here for photos. Click here for driving instructions to the facility. language code: en); insert AltLabel (id: null text: University of Wyoming King Air language code: en);
change note: 2013-07-02 16:59:48.0 [saritz] Insert Concept add broader relation (UWKA [64b518f5-2026-4c5b-9bae-9fa55b5b5778,105253] - Aircraft [227d9c3d-f631-402d-84ed-b8c5a562fc27,73411]);
in scheme: platforms