SPACE WEATHER ADVISORIES
type: Concept

SOLAR WINDS
type: Concept
in scheme: sciencekeywords
definition: The ionized atmosphere above the solar surface that has such a high temperature it can overcome the Sun's gravity and expand outward at supersonic speeds.