SATURATED ADIABATIC LAPSE RATE
type: Concept
change note: 2015-03-04 17:19:08.0 [saritz] Remove Concepts delete narrower relation (null);
change note: 2013-09-04 14:49:00.0 [epneff] Insert Concept add broader relation (SATURATED ADIABATIC LAPSE RATE [65937e73-0cc0-4058-b7dc-12c418ba2ed5,105811] - VERTICAL PROFILES [72304037-ce59-451a-beeb-4258f3db296a,86067]);
change note: 2014-04-15 14:18:41.0 [128.183.164.42] added definition update Definition (National Weather Service Glossary, NOAA, 2009);
change note: 2013-09-04 15:58:23.0 [epneff] Insert Concept add narrower relation (SATURATED ADIABATIC LAPSE RATE [65937e73-0cc0-4058-b7dc-12c418ba2ed5,105811] - SALR [e7f5d499-336f-4450-bbc2-66d4c25eb1a5,105837]);
change note: 2014-04-14 15:30:40.0 [128.183.164.42] added definition insert Definition (id: null text: The rate at which the temperature of a parcel of saturated air decreases as the parcel is lifted in the atmosphere. language code: en);
change note: 2015-03-04 17:19:29.0 [saritz] insert AltLabel (id: null text: SALR language code: en);
definition: The rate at which the temperature of a parcel of saturated air decreases as the parcel is lifted in the atmosphere.
alternative label: SALR
in scheme: sciencekeywords

VERTICAL PROFILES
type: Concept