TOLNet
type: Concept
change note: 2022-06-03 07:23:17.0 [tstevens] insert AltLabel (id: null category: primary text: Tropospheric Ozone Lidar Network language code: en); insert Definition (id: null text: Ozone lidars measure continuous, high resolution ozone profiles critical for process studies and for satellite validation in the lower troposphere. However, the effectiveness of lidar validation by using single-station data is limited. Recently, NASA initiated an interagency ozone lidar observation network under the name TOLNet to promote cooperative multiple-station ozone-lidar observations to provide highly time resolved (few minutes) tropospheric-ozone vertical profiles useful for air-quality studies, model evaluation, and satellite validation. This article briefly describes the concept, stations, major specifications of the TOLNet instruments, and data archiving. language code: en);
change note: 2022-06-03 07:21:47.0 [tstevens] Insert Concept add broader relation (TOLNet [65f63466-cf6b-4f39-adb0-df30533959e8,938205] - S - U [4eb1894b-35b4-406b-8864-944a42bc7702,931627]);
in scheme: projects
definition: Ozone lidars measure continuous, high resolution ozone profiles critical for process studies and for satellite validation in the lower troposphere. However, the effectiveness of lidar validation by using single-station data is limited. Recently, NASA initiated an interagency ozone lidar observation network under the name TOLNet to promote cooperative multiple-station ozone-lidar observations to provide highly time resolved (few minutes) tropospheric-ozone vertical profiles useful for air-quality studies, model evaluation, and satellite validation. This article briefly describes the concept, stations, major specifications of the TOLNet instruments, and data archiving.

S - U
type: Concept