SECCHI
type: Concept
in scheme: instruments
definition: SECCHI is a suite of 5 scientific telescopes SCIP, HI and SEB that will observe the solar corona and inner heliosphere from the surface of the Sun to the orbit of Earth. These unique observations will be made in stereo from NASA's Solar Terrestrial Relations Observatory STEREO. The STEREO mission was successfully launched at 8:52pm EDT on October 25, 2006 from Cape Canaveral in Florida atop a Delta II rocket. The STEREO mission is the third in the line of Solar-Terrestrial Probes (STP) and is a strategic element of the Sun-Earth Connections Roadmap. STEREO is designed to view the three-dimensional (3D) and temporally varying heliosphere by means of an unprecedented combination of imaging and in situ experiments mounted on virtually identical spacecraft flanking the Earth in its orbit. The primary goal of the STEREO mission is to advance the understanding of the three-dimensional structure of the Sun's corona, especially regarding the origin of coronal mass ejections (CMEs), their evolution in the interplanetary medium, and the dynamic coupling between CMEs and the Earth environment. CMEs are the most energetic eruptions on the Sun, are the primary cause of major geomagnetic storms, and are believed to be responsible for the largest solar energetic particle events. The two spacecraft will be launched together and will use a gravity assist from the moon to slingshot the spacecraft into a heliocentric orbit. The first to enter heliocentric orbit will be the Ahead (STEREO-A) spacecraft and then two weeks later the Behind (STEREO-B) spacecraft. The two spacecraft drift away from Earth at an average rate of about 22.5 degrees per year. After the two year nominal operations phase the spacecraft will be about 90 degrees apart, each about 45 degrees from Earth. STEREO-A will drift ahead of Earth and STEREO-B behind. In order to accomplish this drift, STEREO-A will be traveling faster than Earth around the Sun and so must have an orbit slightly closer to the Sun than Earth's.…
change note: 2021-01-04 15:34:13.0 [sritz] update WeightedRelation (Platform-Instrument); update WeightedRelation (1.0); update WeightedRelation (Platform-Instrument); update WeightedRelation (1.0);
change note: 2021-01-04 15:33:26.0 [sritz] update Definition (SECCHI is a suite of 5 scientific telescopes SCIP, HI and SEB that will observe the solar corona and inner heliosphere from the surface of the Sun to the orbit of Earth. These unique observations will be made in stereo from NASA's Solar Terrestrial Relations Observatory STEREO. The STEREO mission was successfully launched at 8:52pm EDT on October 25, 2006 from Cape Canaveral in Florida atop a Delta II rocket. The STEREO mission is the third in the line of Solar-Terrestrial Probes (STP) and is a strategic element of the Sun-Earth Connections Roadmap. STEREO is designed to view the three-dimensional (3D) and temporally varying heliosphere by means of an unprecedented combination of imaging and in situ experiments mounted on virtually identical spacecraft flanking the Earth in its orbit. The primary goal of the STEREO mission is to advance the understanding of the three-dimensional structure of the Sun's corona, especially regarding the origin of coronal mass ejections (CMEs), their evolution in the interplanetary medium, and the dynamic coupling between CMEs and the Earth environment. CMEs are the most energetic eruptions on the Sun, are the primary cause of major geomagnetic storms, and are believed to be responsible for the largest solar energetic particle events. The two spacecraft will be launched together and will use a gravity assist from the moon to slingshot the spacecraft into a heliocentric orbit. The first to enter heliocentric orbit will be the Ahead (STEREO-A) spacecraft and then two weeks later the Behind (STEREO-B) spacecraft. The two spacecraft drift away from Earth at an average rate of about 22.5 degrees per year. After the two year nominal operations phase the spacecraft will be about 90 degrees apart, each about 45 degrees from Earth. STEREO-A will drift ahead of Earth and STEREO-B behind. In order to accomplish this drift, STEREO-A will be traveling faster than Earth around the Sun and so must have …

Ultraviolet Instruments
type: Concept