ACATS
type: Concept
in scheme: instruments
definition: Airborne Chromatograph For Atmospheric Trace Species (ACATS) is designed to measure a variety of organic chlorine and long-lived species in the stratosphere and upper troposphere. The instrument includes four separate gas chromatographic (GC) channels each incorporating an electron capture detector. Channels can be configured by selecting different GC columns to measure the following combination of individual trace gas species: CFC-11 and CFC-113; CH3CCl3 (MC) and CCl4 (CT); CFC-12 and N2O; or HCFC-22, CH3Cl, or hydrogen, methane and carbon monoxide. The gas chromatograph can measure one sample every 2-3 minutes with a detection limit of 2% of the maximum tropospheric value. The absolute accuracy of the measurement is +/- 3% plus precision. This research is supported by the High Speed Research Program (HSRP) of NASA and the Atmospheric Chemistry Project of NOAA's Global Climate Change Program. Additional information available at the ACATS Home Page: http://www.esrl.noaa.gov/gmd/hats/airborne/acats/ [Summary provided by NOAA] Group: Instrument_Details Entry_ID: ACATS Group: Instrument_Identification Instrument_Category: In Situ/Laboratory Instruments Instrument_Class: Chemical Meters/Analyzers Short_Name: ACATS Long_Name: Airborne Chromatograph for Atmospheric Trace Species End_Group Group: Associated_Platforms Short_Name: NASA WB-57F End_Group Online_Resource: http://www.esrl.noaa.gov/gmd/hats/airborne/acats/ End_Group

Chemical Meters/Analyzers
type: Concept