Earth Observation Satellites
type: Concept

CASSIOPE
type: Concept
change note: 2019-05-06 10:05:48.0 [mmorahan] insert WeightedRelation (id: null related concept uuid: f1f8384c-3846-443b-8bd1-18b7696aafd4 relationship type: null relationship value: null generated by: null); insert WeightedRelation (id: null related concept uuid: 1c03710e-1898-49ec-84bb-c064e7a358d0 relationship type: null relationship value: null generated by: null); insert WeightedRelation (id: null related concept uuid: 02a50e11-e6ee-4b05-a157-32cf57a74adf relationship type: null relationship value: null generated by: null);
change note: 2019-05-06 09:51:35.0 [mmorahan] insert WeightedRelation (id: null related concept uuid: a96885e0-9dc1-4edb-bc29-1cdb320d50f2 relationship type: null relationship value: null generated by: null); insert WeightedRelation (id: null related concept uuid: ee53dfb1-6495-405e-953b-63434a2ec27e relationship type: null relationship value: null generated by: null); insert WeightedRelation (id: null related concept uuid: 0c439fcf-b55c-430e-baee-ae047032df46 relationship type: null relationship value: null generated by: null); insert WeightedRelation (id: null related concept uuid: e0134cc6-79d0-492d-9e9a-6320e04ed972 relationship type: null relationship value: null generated by: null); insert WeightedRelation (id: null related concept uuid: eb47a4c5-5ab5-4803-9395-f58de828499c relationship type: null relationship value: null generated by: null);
change note: 2019-04-25 07:15:18.0 [mmorahan] insert AltLabel (id: null category: primary text: Cascade SmallSat and Ionospheric Polar Explorer language code: en); insert Definition (id: null text: CASSIOPE (Cascade SmallSat and Ionospheric Polar Explorer)is a new generation of small-satellite and multifunctional platform technology demonstration program of CSA (Canadian Space Agency) with the goal to serve both, namely scientific and commercial support applications in a variety of future Canadian space missions. The science mission, called ePOP (Enhanced Polar Outflow Probe), is comprised of eight instruments. The objective is to measure the interaction of the Earth's upper atmosphere with the solar wind (space weather monitoring with greatly improved prediction capability). language code: en);
change note: 2019-04-25 07:10:05.0 [mmorahan] Insert Concept add broader relation (CASSIOPE [66f5d236-40fb-4a41-96a4-761d48103765,368665] - Earth Observation Satellites [3466eed1-2fbb-49bf-ab0b-dc08731d502b,344761]);
in scheme: platforms
definition: CASSIOPE (Cascade SmallSat and Ionospheric Polar Explorer)is a new generation of small-satellite and multifunctional platform technology demonstration program of CSA (Canadian Space Agency) with the goal to serve both, namely scientific and commercial support applications in a variety of future Canadian space missions. The science mission, called ePOP (Enhanced Polar Outflow Probe), is comprised of eight instruments. The objective is to measure the interaction of the Earth's upper atmosphere with the solar wind (space weather monitoring with greatly improved prediction capability).