E-GEOS
type: Concept
in scheme: providers
definition: [Source: e-geos home page, http://www.e-geos.it/geos.htm ] e-GEOS is a company between the Italian Space Agency (ASI) (20%) and Telespazio (80%), a Finmeccanica/Thales company. The company will be a leading player in the geo-spatial business at international level through a combined offering of application solutions, content and services. e-GEOS's mission is mainly to promote and sell on the international market the applications of COSMO-SkyMed, ASI and the Italian Defence Ministry's Earth observation programme.

COMMERCIAL
type: Concept