TET-1
type: Concept
in scheme: platforms
change note: 2019-03-11 13:32:55.0 [mmorahan] insert WeightedRelation (id: null related concept uuid: e9d9df16-ebbf-4f6d-838f-225716619ff9 relationship type: null relationship value: null generated by: null); insert WeightedRelation (id: null related concept uuid: 7c6ddfcd-00e3-4194-be91-9a9648f9d30b relationship type: null relationship value: null generated by: null);
change note: 2018-10-11 16:36:06.0 [mmorahan] insert AltLabel (id: null category: primary text: Technology Experiment Carrier-1 language code: en);
change note: 2018-10-11 16:32:16.0 [mmorahan] insert Definition (id: null text: TET-1 (Technologie Erprobungs Träger-1) is a German technology demonstration microsatellite of DLR (German Aerospace Center) within its OOV (On-Orbit Verification) program. Project funding is provided by the German Ministry for Economics and Technology (Bundesministerium für Wirtschaft und Technologie). The overall objective is to provide industry and research institutes with adequate means for the in-flight validation of space technology. Certain programmatic rules were established for the space segment and the ground segment to realize TET-1 as a low-cost mission within a relatively short timeframe under the leadership of an industrial space company as prime contractor. Flight opportunities for technology demonstration and verification should ideally be provided on a regular basis in a cost efficient and safe manner. A market survey of German industries' and institutes' technologies has shown that about 75% of the experiments can be verified using a microsatellite. The OOV-Program is thus structured into two main parts with respect to the flight opportunities offered. The first comprises the microsatellites TET with a planned flight opportunity every two years. For payloads which do not fit on TET microsatellite concept, DLR will cooperate with national and international partners to provide flight opportunities on other carriers. language code: en);
change note: 2018-10-11 16:28:51.0 [mmorahan] Insert Concept add broader relation (TET-1 [67e5bbab-0c9b-40e5-acf7-054671f35d2b,368163] - FireBIRD [9b165321-e03c-44dc-bb9c-d10c32c93ab6,368159]);
definition: TET-1 (Technologie Erprobungs Träger-1) is a German technology demonstration microsatellite of DLR (German Aerospace Center) within its OOV (On-Orbit Verification) program. Project funding is provided by the German Ministry for Economics and Technology (Bundesministerium für Wirtschaft und Technologie). The overall objective is to provide industry and research institutes with adequate means for the in-flight validation of space technology. Certain programmatic rules were established for the space segment and the ground segment to realize TET-1 as a low-cost mission within a relatively short timeframe under the leadership of an industrial space company as prime contractor. Flight opportunities for technology demonstration and verification should ideally be provided on a regular basis in a cost efficient and safe manner. A market survey of German industries' and institutes' technologies has shown that about 75% of the experiments can be verified using a microsatellite. The OOV-Program is thus structured into two main parts with respect to the flight opportunities offered. The first comprises the microsatellites TET with a planned flight opportunity every two years. For payloads which do not fit on TET microsatellite concept, DLR will cooperate with national and international partners to provide flight opportunities on other carriers.

FireBIRD
type: Concept