GAMMA RAY SPECTROMETERS
type: Concept
in scheme: instruments
definition: A GAMMA RAY SPECTROMETER is a spectroscope used for obtaining a mass spectrum by deflecting the gamma ray particles into a thin slit and measuring the radiation given off or deflected and relating it to other studies.

X-Ray/Gamma Ray Detectors
type: Concept