TECTONIC LANDFORMS
type: Concept

PLATEAU
type: Concept
change note: 2013-08-16 10:23:01.0 [tbs1979] insert Definition (id: null text: An area of highland, usually consisting of relatively flat terrain. A highly eroded plateau is called a dissected plateau. A volcanic plateau is a plateau produced by volcanic activity. language code: en);
change note: 2013-08-05 13:57:30.0 [tbs1979] Insert Concept add broader relation (PLATEAU [694e18ec-ceaf-4070-9763-f3ee6dbd6b5b,105401] - TECTONIC LANDFORMS [9673dc0b-89c0-4f0c-b378-f1c8cb267c8f,105291]);
in scheme: sciencekeywords
definition: An area of highland, usually consisting of relatively flat terrain. A highly eroded plateau is called a dissected plateau. A volcanic plateau is a plateau produced by volcanic activity.