MULTINATIONAL ORGANIZATIONS
type: Concept

WDC/METEOROLOGY, OBNINSK
type: Concept
in scheme: providers
definition: The Obninsk World Data Center for Meteorology provides hydrometeorological data, Russian state fund of data on condition of environment, climate research, and other global related meteorology data. Website: "http://www.meteo.ru/"