COLORIMETERS
type: Concept
change note: 2021-08-04 18:06:33.0 [sritz] insert AltLabel (id: null category: primary text: COLORIMETERS language code: en);
in scheme: instruments
definition: COLORIMETERS are instruments that use the form of absorption spectroscopy in which a reagent bonds with the species of interest and is added to a liquid solution, resulting in the change in color of the solution; used for determining metals in atmospheric aerosols.

Spectrometers/Radiometers
type: Concept