COASTAL LANDFORMS
type: Concept

BEACHES
type: Concept
change note: 2013-03-22 10:56:24.0 [tbs1979] insert Definition (id: null text: Geological landform along the shoreline of an ocean, sea or lake. It usually consists of loose particles which are often composed of rock, such as sand, gravel, shingle, pebbles, waves or cobblestones. language code: en);
change note: 2013-02-18 12:21:35.0 [tbs1979] Insert Concept add broader relation (BEACHES [6a5d3e4d-86d1-4863-bfe6-f8e2899fab0e,82557] - COASTAL LANDFORMS [c58320e6-3f1d-4c36-9bee-6bad73404c21,62739]);
in scheme: sciencekeywords
definition: Geological landform along the shoreline of an ocean, sea or lake. It usually consists of loose particles which are often composed of rock, such as sand, gravel, shingle, pebbles, waves or cobblestones.