AMMONIA
type: Concept
in scheme: sciencekeywords
definition: Ammonia (NH3) is a reduced nitrogen gas and is emitted in large quantities from animal feedstocks, sewerage plants, etc. Ammonia is very soluble in water and is scavenged from the lower atmosphere by clouds. Ammonia is the most abundant alkaline gas in the atmosphere and plays a large role in neutralizing acidity from sulfuric and nitric acids via formation of the ammonium ion.

NITROGEN COMPOUNDS
type: Concept