ACADEMIC
type: Concept

UC-BERKELEY/GSE
type: Concept
in scheme: providers
definition: The Graduate School of Education, like other academic departments and professional schools on the Berkeley campus, is permitted by the Graduate Division to recommend the admission of only a limited number of students each year. Summary Provided By: http://www-gse.berkeley.edu/admin/sas/requirements.html