M - O
type: Concept

MTPE
type: Concept
in scheme: projects
definition: MUSEUMS TEACHING PLANET EARTH (MuTPE) is an innovative concept in outreach recently selected to be a member of the ESIP (Earth Science Information Partnership) Federation, a program of NASA's Office of Earth Science. An expansion of the successful "Public Connection" program funded by NASA's Learning Technologies Program, this program uses three independent mechanisms for educating the public about Earth science... http://earth.rice.edu/mtpe/mtpe.html