EMIT Imaging Spectrometer
type: Concept
change note: 2022-04-11 15:58:18.0 [sritz] update WeightedRelation (Platform-Instrument); update WeightedRelation (1.0);
change note: 2021-11-30 17:37:58.0 [sritz] Insert Concept add broader relation (EMIT Imaging Spectrometer [6ad03566-0766-4e23-bb6c-1a89bf74329b,835918] - Imaging Spectrometers/Radiometers [944b7691-af37-4fb4-9393-c114e7997829,827926]);
change note: 2022-04-11 15:57:51.0 [sritz] insert WeightedRelation (id: null related concept uuid: 93c5d18c-be62-46c4-9545-42f73a854d85 relationship type: null relationship value: null generated by: null);
change note: 2021-12-15 16:32:21.0 [sritz] update Definition (https://earth.jpl.nasa.gov/emit/);
definition: he Earth Surface Mineral Dust Source Investigation (EMIT) Imaging Spectrometer is a NASA Earth Venture Instrument (EVI-4) mounted to the exterior of the International Space Station (ISS). EMIT will be the first instrument to use NASA invented imaging spectroscopy technology to comprehensively measure the different wavelengths of light emitted by minerals on the surface of deserts and other dust sources to determine their composition.
in scheme: instruments

Imaging Spectrometers/Radiometers
type: Concept