ARESE
type: Concept
in scheme: projects
definition: ARESE, the ARM Enhanced Shortwave Experiment, concluded a very successful deployment to Oklahoma on November 1, 1995. The purpose of this five week long campaign was to conduct a series of instrumented flights to measure the interaction of solar energy with clear and cloudy skies to provide additional insight into recent observations of enhanced absorption in cloudy atmospheres.As such, ARESE focused on two scientific objectives: (1) the direct measurement of the absorption of solar radiation by clear and cloudy atmospheres and the placement of bounds on these measurements; and (2) the investigation of the possible causes of absorption in excess of the model predictions. To accomplish these objectives, ARESE used a combination of satellite, aircraft, and ground observations to make highly accurate solar flux measurements at different altitudes throughout the atmospheric column. At the heart of this was a carefully "stacked" Twin Otter and Egrett "cloud sandwich" with the Otter at 1500 - 5000 ft and the Egrett at 43,000 ft. This was overflown by an ER-2 flying at 65,000 ft, which because of its much higher speed did not stay in constant alignment with the Twin Otter/Egrett stack but did provide periodic coincidences with these other aircraft. All three aircraft carried identical up- and down-looking "Valero" radiometers and flew over identical up-looking radiometers at the CART central and extended facilities. Radiance measurements from the GOES satellites were used to retrieve top-of-the atmosphere fluxes. These flux measurements were supplemented by a variety of cloud property measurements from the ground, the Egrett and the ER-2, including! radar, lidar and multispectral measurements. These baseline ARESE flights were conducted at the CART site from September 25 through November 1. During that time we flew twelve scientific data flights and accumulated approximately 60 hours of in-flight data under a variety of atmospheric conditions ranging from clear to solid ov…

A - C
type: Concept