DISASTER RECOVERY/RELIEF
type: Concept
in scheme: sciencekeywords
definition: The act of restoring a community or ecosystem to its original pre-hazard state. Relief refers to assistance that eases the financial, physical, or emotional burden brought about by exposure of property or person to natural hazards or disasters.

HAZARDS MANAGEMENT
type: Concept