LSU/GEOL/OASIC
type: Concept
in scheme: providers
definition: The Bao-Marchant data set is a high-resolution (vertical) concentrations and stable isotope compositions for water-soluble anions and cations form various soils in the MDV. Each soil samples were taken from newly excavated soil pits with the highest resolution physically attenable in the loosely packed soil materials, ~ 2-10 cm each. Summary Provided By: http://clic.npolar.no/disc/disc_datasets_metadata.php?s=0&desc=1&table=Datasets&id=DISC_GCMD_Bao-Marchant_MDV_high-resolution_soil_ions&tag=All&Category=&WCRP=&Location=All&stype=phrase&limit=10&q=

ACADEMIC
type: Concept