M - O
type: Concept

OCEAN
type: Concept
in scheme: projects
definition: The Ocean Color European Archive Network (OCEAN) is jointly funded by the European Space Agency, the ESRIN Establishment in Frascati, and by CEC-Comission of European Communities, Joint Research Centre at Ispra and involves the collection of the pseudo colour (the Ocean pigment concentration). The archive data network allows users to search through the collection of data. Users can search by geo-location, date, orbit, section and precentage of water.