Korea Multi-Purpose Satellite (KOMPSAT)
type: Concept

KOMPSAT-5
type: Concept
definition: KOMPSAT-5 is part of the Korean National Development Plan of MEST (Ministry of Education, Science and Technology) which started in 2005. The project is being developed and managed by KARI (Korea Aerospace Research Institute).
change note: 2022-03-16 17:19:15.0 [sritz] update WeightedRelation (Platform-Instrument); update WeightedRelation (1.0);
change note: 2022-03-15 10:58:06.0 [sritz] Insert Concept add broader relation (KOMPSAT-5 [6b65fb1a-d7ee-4abd-bacb-d2a912110d60,836083] - Korea Multi-Purpose Satellite (KOMPSAT) [9abdb7c0-7b8e-426b-8bc7-57ea4a30d82c,826542]);
change note: 2022-03-16 17:14:36.0 [sritz] insert WeightedRelation (id: null related concept uuid: dcee7eaa-c2b6-4fe7-857d-7411828bbf3b relationship type: null relationship value: null generated by: null);
change note: 2022-03-15 11:00:04.0 [sritz] update AltLabel (Korea Multi-Purpose Satellite - 5);
change note: 2022-03-15 10:59:33.0 [sritz] insert AltLabel (id: null category: primary text: Korea Multi-Purpose Satellite _KOMPSAT_ language code: en);
change note: 2022-03-15 11:00:37.0 [sritz] insert Definition (id: null text: KOMPSAT-5 is part of the Korean National Development Plan of MEST (Ministry of Education, Science and Technology) which started in 2005. The project is being developed and managed by KARI (Korea Aerospace Research Institute). language code: en);
in scheme: platforms