PYRANOMETERS
type: Concept
change note: 2021-08-05 16:53:24.0 [sritz] insert AltLabel (id: null category: primary text: PYRANOMETERS language code: en);
change note: 2021-08-05 16:52:02.0 [sritz] insert AltLabel (id: null category: primary text: PYRANOMETERS language code: en);
in scheme: instruments
definition: PYRANOMETERS sometimes referred as solarimeters; the class of actinometers that measure the combined intensity of incoming direct solar radiation and diffuse sky radiation; consists of a recorder and a radiation sensing element that is mounted so it is able to view the entire sky.

Thermal/Radiation Detectors
type: Concept