Northern-Vermont/METEO
type: Concept
in scheme: providers
definition: Since 1974, the Department of Atmospheric Sciences has developed a well-known and respected pre-professional program, initially as part of Lyndon State College, and now as part of Northern Vermont University-Lyndon. More Information: http://atmos.northernvermont.edu/ [Summary provided by Northern Vermont University Atmospheric Sciences]
change note: 2019-12-27 18:00:50.0 [sritz] update PrefLabel (Northern-Vermont/METEO);
change note: 2019-12-27 17:59:54.0 [sritz] update AltLabel (Meteorology Department, Northern Vermont University); update PrefLabel (Northern Vermont University/METEO); update Definition (Since 1974, the Department of Atmospheric Sciences has developed a well-known and respected pre-professional program, initially as part of Lyndon State College, and now as part of Northern Vermont University-Lyndon. More Information: http://atmos.northernvermont.edu/ [Summary provided by Northern Vermont University Atmospheric Sciences]); update Definition (Northern Vermont University Atmospheric Sciences, http://atmos.northernvermont.edu/); update Resource (provider); update Resource (http://atmos.northernvermont.edu/);

ACADEMIC
type: Concept