GROUNDING LINE
type: Concept
change note: 2020-01-15 08:01:04.0 [tstevens] Insert Concept add broader relation (GROUNDING LINE [6c06019d-97df-499a-ab03-64b615af547a,559659] - GLACIERS [4a426aab-4a95-4bf4-8449-19a72a251541,85205]);
in scheme: sciencekeywords
definition: Marks the locations where said glaciers become anchored on bedrock (i.e., the estimated coastline underneath the ice).

GLACIERS
type: Concept