GLACIER RUNOFF
type: Concept
change note: 2020-02-27 12:45:25.0 [tstevens] Insert Concept add broader relation (GLACIER RUNOFF [6c3aa715-61fd-47a1-804e-fb6d461792ea,559833] - GLACIERS [68eed887-8008-4352-b420-949457ab59ab,84413]);
in scheme: sciencekeywords
definition: The amount of water produced by glacial melt.

GLACIERS
type: Concept