STANFORD-U/SSG/HMI
type: Concept
in scheme: providers
definition: The Joint Science Operations Center (JSOC) HMI - AIA Science Data Processing (SDP) home page provides access to the NASA Solar Dynamics Observatory (SDO) Helioseismic and Magnetic Imager (HMI) data products.

ACADEMIC
type: Concept