WUSTL/DATAFED
type: Concept
in scheme: providers
definition: DataFed provides standardized access to heterogeneous distributed air quality data and tools for data analysis and presentation. Information provided by http://datafedwiki.wustl.edu/index.php/DataFed_Wiki

ACADEMIC
type: Concept