DIDM
type: Concept
in scheme: instruments
definition: [Source: AMPTEK, http://www.amptek.com/didm.html ] Digital Ion Drift Meter (DIDM) instruments are designed to measure the velocity vectors of ambient ions at a spacecraft's location. Measurements of ion density and temperature are also provided. The local electrical field strength can be obtained via the relationship between electrical field, ion drift velocity and the measured magnetic field provided by on-board magnetometer. More information: http://www.amptek.com/didm.html Group: Instrument_Details Entry_ID: DIDM Group: Instrument_Identification Instrument_Category: Solar/Space Observing Instruments Instrument_Class: Particle Detectors Short_Name: DIDM Long_Name: Planar Langmuir Probe End_Group Group: Associated_Platforms Short_Name: CHAMP End_Group Online_Resource: http://www.amptek.com/didm.html Sample_Image: http://www.amptek.com/didm2.gif Creation_Date: 2009-10-07 Group: Instrument_Logistics Instrument_Owner: Germany/GFZ End_Group End_Group

Particle Detectors
type: Concept