DU/PL
type: Concept
in scheme: providers
definition: The Music Library is a limited access facility. As a branch library of DU Penrose Library, the resources and services of the Penrose Library and the Music Library of the University of Denver are developed and maintained primarily for members of the DU community. By showing valid DU identification upon entering the Music Library, all DU students, faculty and staff have unrestricted access to collections and services as well as a range of borrowing privileges described below.

ACADEMIC
type: Concept