Permanent Land Sites
type: Concept

Vaisala HydroMet AWS
type: Concept
change note: 2020-11-16 15:31:51.0 [sritz] insert AltLabel (id: null category: primary text: Vaisala HydroMet Automatic Weather Station language code: en); insert Definition (id: null text: The Vaisala HydroMet™ Automatic Weather Station MAWS201 is a portable AWS for temporary installations, featuring the same design as the Vaisala TacMet Tactical Meteorological Observation System MAWS201M for demanding tactical meteorological applications. Its lightweight aluminium tripod and easy-to-use connectors make it fast to set up. Each leg is adjustable for use on uneven terrain. language code: en);
change note: 2020-11-16 15:30:41.0 [sritz] Insert Concept add broader relation (Vaisala HydroMet AWS [6c9e32c9-bcc2-4e70-97a1-8a31a23ba65a,560781] - WEATHER STATIONS/NETWORKS [57b7373d-5c21-4abb-8097-a410adc2a074,541765]);
change note: 2022-02-11 09:42:07.0 [tstevens] update Definition (The Vaisala HydroMet Automatic Weather Station MAWS201 is a portable AWS for temporary installations, featuring the same design as the Vaisala TacMet Tactical Meteorological Observation System MAWS201M for demanding tactical meteorological applications. Its lightweight aluminium tripod and easy-to-use connectors make it fast to set up. Each leg is adjustable for use on uneven terrain.);
change note: 2021-11-18 08:27:01.0 [tstevens] Move Concepts delete broader relation (null); add broader relation (Vaisala HydroMet AWS [6c9e32c9-bcc2-4e70-97a1-8a31a23ba65a,826344] - Permanent Land Sites [0ec10fd9-492c-498a-b6d8-e2840cc3643b,835887]);
definition: The Vaisala HydroMet Automatic Weather Station MAWS201 is a portable AWS for temporary installations, featuring the same design as the Vaisala TacMet Tactical Meteorological Observation System MAWS201M for demanding tactical meteorological applications. Its lightweight aluminium tripod and easy-to-use connectors make it fast to set up. Each leg is adjustable for use on uneven terrain.
in scheme: platforms