IFPRI
type: Concept
in scheme: providers
definition: The International Food Policy Research Institute (IFPRI) seeks sustainable solutions for ending hunger and poverty. IFPRI is one of 15 centers supported by the Consultative Group on International Agricultural Research (CGIAR), an alliance of 64 governments, private foundations, and international and regional organizations.

CONSORTIA/INSTITUTIONS
type: Concept