CALIPSO-NVF
type: Concept
change note: 2023-02-01 10:33:22.0 [sritz] update WeightedRelation (Similar); update WeightedRelation (1.0); update WeightedRelation (Similar); update WeightedRelation (1.0);
change note: 2023-02-01 10:28:01.0 [sritz] Insert Concept add broader relation (CALIPSO-NVF [6d8da977-caa2-42bd-adc8-5f5c8b496dba,1202698] - A - C [0c89f3f4-7ab1-43ce-89ee-795d35f0e30a,1195592]);
change note: 2023-02-01 10:28:53.0 [sritz] insert AltLabel (id: null category: primary text: CALIPSO Night Validation Flights language code: en);
change note: 2023-02-01 10:31:53.0 [sritz] insert WeightedRelation (id: null related concept uuid: 865292d8-91d9-42fc-8f5e-350c9d5d64cc relationship type: null relationship value: null generated by: null);
change note: 2023-02-01 10:30:06.0 [sritz] insert Definition (id: null text: CALIPSO-NVF 2022 is a NASA airborne deployment of the LaRC HSRL-2 out of Bermuda for a series of nighttime underflights of the CALIPSO satellite. The goal is to verify the nighttime calibration and feature detection accuracy of the CALIPSO lidar. language code: en);
change note: 2023-02-01 10:31:20.0 [sritz] insert WeightedRelation (id: null related concept uuid: 01b319ce-cbe2-4894-bb33-04c43ceef23b relationship type: null relationship value: null generated by: null);
in scheme: projects
definition: CALIPSO-NVF 2022 is a NASA airborne deployment of the LaRC HSRL-2 out of Bermuda for a series of nighttime underflights of the CALIPSO satellite. The goal is to verify the nighttime calibration and feature detection accuracy of the CALIPSO lidar.

A - C
type: Concept