UKRAINE
type: Concept

UA/UAS/IBSS
type: Concept
in scheme: providers
definition: Kovalevsky Institute of Biology of the Southern Seas National Academy of Sciences of Ukraine (Sevastopol) has been publishing “Marine Ecological Journal” since 2002. Summary Provided By: http://www.ibss.org.ua/Default.aspx?tabid=167